autor-main

By Rlpkmfa Nfxyjdl on 14/06/2024

How To Org.apache.spark.sparkexception job aborted due to stage failure: 5 Strategies That Work

Apr 9, 2021 · Viewed 8k times. 1. I am trying to do some computation using UDFs. But after the computation when i try to convert the pyspark dataframe to pandas it gives me org.apache.spark.SparkException: Exception thrown in awaitResult: I will put down the reproducible code. import pandas as pd import numpy as np import time n = 10000 sample_df = pd ... Jun 20, 2019 · Here is a method to parallelize serial JDBC reads across multiple spark workers... you can use this as a guide to customize it to your source data ... basically the main prerequisite is to have some kind of unique key to split on. When a stage failure occurs, the Spark driver logs report an exception similar to the following: org.apache.spark.SparkException: Job aborted due to stage failure: Task XXX in stage YYY failed 4 times, most recent failure: Lost task XXX in stage YYY (TID ZZZ, ip-xxx-xx-x-xxx.compute.internal, executor NNN): ExecutorLostFailure (executor NNN ...Caused by: org.apache.spark.SparkException: Job aborted due to stage failure: Task 6 in stage 16.0 failed 4 times, most recent failure: Lost task 6.3 in stage 16.0 (TID 478, idc-sql-dms-13, executor 40): ExecutorLostFailure (executor 40 exited caused by one of the running tasks) Reason: Container killed by YARN for exceeding memory limits. 11.8 ...Teams. Q&A for work. Connect and share knowledge within a single location that is structured and easy to search. Learn more about TeamsI am doing it using spark code. But when i try to run the code I get following exception org.apache.spark.SparkException: Job aborted due to stage failure: Task 2 in stage 1.0 failed 4 times, most recent failure: Lost task 2.3 in stage 1.0 (TID 9, XXXX.XXX.XXX.local): org.apache.spark.SparkException: Task failed while writing rows.May 15, 2017 · : org.apache.spark.SparkException: Job aborted due to stage failure: Serialized task 302987:27 was 139041896 bytes, which exceeds max allowed: spark.akka.frameSize (134217728 bytes) - reserved (204800 bytes). When I run the demo : from pyspark.ml.linalg import Vectors import tempfile conf = SparkConf().setAppName('ansonzhou_test').setAll([ ('spark.executor.memory', '8g ...Here is the full list of commands creating the list, writing it to HDFS and finally printing out the results on the console using hdfs: spark-shell. After the shell has started you type: val nums = sc.parallelize (List (1,2,3,4,5)) nums.saveAsTextFile ("/tmp/simple_list") :quit. Now we read the data from HDFS (Hadoop File System):Dec 29, 2020 · When I run the demo : from pyspark.ml.linalg import Vectors import tempfile conf = SparkConf().setAppName('ansonzhou_test').setAll([ ('spark.executor.memory', '8g ... I am doing it using spark code. But when i try to run the code I get following exception org.apache.spark.SparkException: Job aborted due to stage failure: Task 2 in stage 1.0 failed 4 times, most recent failure: Lost task 2.3 in stage 1.0 (TID 9, XXXX.XXX.XXX.local): org.apache.spark.SparkException: Task failed while writing rows. Solution 1. Check your environment variables. You are getting “py4j.protocol.Py4JError: org.apache.spark.api.python.PythonUtils.getEncryptionEnabled does not exist in the JVM” due to Spark environemnt variables are not set right. Feb 1, 2017 · Pyspark. spark.SparkException: Job aborted due to stage failure: Task 0 in stage 15.0 failed 1 times, java.net.SocketException: Connection reset Hot Network Questions Main character is charged an exorbitant computing bill after abusing his uploaded consciousness powers org.apache.spark.SparkException: Job aborted due to stage failure: Task 3 in stage 6.0 failed 1 times, most recent failure: Lost task 3.0 in stage 6.0 (TID 62, LAPTOP-H7MM9952, executor driver): org.apache.spark.SparkException: Task failed while writing rows.Caused by: org.apache.spark.SparkException: Job aborted due to stage failure: Task 6 in stage 16.0 failed 4 times, most recent failure: Lost task 6.3 in stage 16.0 (TID 478, idc-sql-dms-13, executor 40): ExecutorLostFailure (executor 40 exited caused by one of the running tasks) Reason: Container killed by YARN for exceeding memory limits. 11.8 ... Mar 30, 2020 · org.apache.spark.SparkException: Job aborted due to stage failure: Task 29 in stage 0.0 failed 4 times, most recent failure: Lost task 29.3 in stage 0.0 (TID 92, 10.252.252.125, executor 23): ExecutorLostFailure (executor 23 exited caused by one of the running tasks) Reason: Remote RPC client disassociated. Oct 30, 2018 · You need to change this parameter in the cluster configuration. Go into the cluster settings, under Advanced select spark and paste spark.driver.maxResultSize 0 (for unlimited) or whatever the value suits you. Using 0 is not recommended. You should optimize the job by re partitioning. Oct 30, 2018 · You need to change this parameter in the cluster configuration. Go into the cluster settings, under Advanced select spark and paste spark.driver.maxResultSize 0 (for unlimited) or whatever the value suits you. Using 0 is not recommended. You should optimize the job by re partitioning. Hi! I run 2 to spark an option SPARK_MAJOR_VERSION=2 pyspark --master yarn --verbose spark starts, I run the SC and get an error, the field in the table exactly there. not the problem SPARK_MAJOR_VERSION=2 pyspark --master yarn --verbose SPARK_MAJOR_VERSION is set to 2, using Spark2 Python 2.7.12 ...1. "Accept timed out" generally points to a problem with your spark instance. It may be overloaded or not enough resources (memory/cpu) to start your job or it might be a temporary network issue. You can monitor you jobs on Spark UI. Also there is some issue with your code.Aug 20, 2018 · 报错如下: : org.apache.spark.SparkException: Job aborted due to stage failure: Task 0 in stage 3.0 failed 4 times, most recent failure: ... Oct 6, 2016 · Teams. Q&A for work. Connect and share knowledge within a single location that is structured and easy to search. Learn more about Teams Nov 15, 2021 · Job aborted due to stage failure: Task 5 in stage 3.0 failed 1 times 8 Exception: Java gateway process exited before sending the driver its port number while creating a Spark Session in Python Check the Availability of Free RAM - whether it matches the expectation of the job being executed. Run below on each of the servers in the cluster and check how much RAM & Space they have in offer. free -h. If you are using any HDFS files in the Spark job , make sure to Specify & Correctly use the HDFS URL.In my project i am using spark-Cassandra-connector to read the from Cassandra table and process it further into JavaRDD but i am facing issue while processing Cassandra row to javaRDD.strange org.apache.spark.SparkException: Job aborted due to stage failure again. I'm trying to deploy spark application on standalone mode. In this application I'm training Naive Bayes classifier by using tf-idf vectors. I wrote application in similar manner to this post ( Spark MLLib TFIDF implementation for LogisticRegression ) The difference ...Mar 30, 2020 · org.apache.spark.SparkException: Job aborted due to stage failure: Task 29 in stage 0.0 failed 4 times, most recent failure: Lost task 29.3 in stage 0.0 (TID 92, 10.252.252.125, executor 23): ExecutorLostFailure (executor 23 exited caused by one of the running tasks) Reason: Remote RPC client disassociated. Here is a method to parallelize serial JDBC reads across multiple spark workers... you can use this as a guide to customize it to your source data ... basically the main prerequisite is to have some kind of unique key to split on.SparkException:执行 spark 操作时 Python 工作线程无法连接回spark.SparkException: Python worker failed to connect back.问问题当我尝试在 pyspark 执行此命令行时from pyspark import SparkConf, SparkContext# 创建SparkConf和SparkContextconf = SparkConf().setMaster("local").setAppName("licorg.apache.spark.SparkException: Job aborted due to stage failure: Task in stage failed,Lost task in stage : ExecutorLostFailure (executor 4 lost) 12 org.apache.spark.SparkException: Job aborted due to stage failure: Task 98 in stage 11.0 failed 4 timesJan 4, 2019 · Exception in thread "main" org.apache.spark.SparkException: Job aborted due to stage failure: Task 0 in stage 2.0 failed 1 times, most recent failure: Lost task 0.0 in stage 2.0 (TID 119, localhost, executor driver): ExecutorLostFailure (executor driver exited caused by one of the running tasks) Reason: Executor heartbeat timed out after 128839 ... Use the DF transformations to create the statistics you need, THEN call collect/show to get the result back to the driver. That way you are only downloading the stats, not the full data.Nov 1, 2017 · Saved searches Use saved searches to filter your results more quickly Jul 17, 2020 · Caused by: org.apache.spark.SparkException: Job aborted due to stage failure: Serialized task 2:0 was 155731289 bytes, which exceeds max allowed: spark.rpc.message.maxSize (134217728 bytes). Consider increasing spark.rpc.message.maxSize or using broadcast variables for large values. You need to change this parameter in the cluster configuration. Go into the cluster settings, under Advanced select spark and paste spark.driver.maxResultSize 0 (for unlimited) or whatever the value suits you. Using 0 is not recommended. You should optimize the job by re partitioning. See the links below for more information: https://docs ...Jan 4, 2019 · Exception in thread "main" org.apache.spark.SparkException: Job aborted due to stage failure: Task 0 in stage 2.0 failed 1 times, most recent failure: Lost task 0.0 in stage 2.0 (TID 119, localhost, executor driver): ExecutorLostFailure (executor driver exited caused by one of the running tasks) Reason: Executor heartbeat timed out after 128839 ... org.apache.spark.SparkException: Job aborted due to stage failure: Task XXX in stage YYY failed 4 times, most recent failure: Lost task XXX in stage YYY (TID ZZZ, ip-xxx-xx-x-xxx.compute.internal, executor NNN): ExecutorLostFailure (executor NNN exited caused by one of the running tasks) Reason: ... 解決方法 理由コードの検索 Aug 9, 2021 · You need to change this parameter in the cluster configuration. Go into the cluster settings, under Advanced select spark and paste spark.driver.maxResultSize 0 (for unlimited) or whatever the value suits you. Using 0 is not recommended. You should optimize the job by re partitioning. See the links below for more information: https://docs ... Data collection is indirect, with data being stored both on the JVM side and Python side. While JVM memory can be released once data goes through socket, peak memory usage should account for both. Plain toPandas implementation collects Rows first, then creates Pandas DataFrame locally. This further increases (possibly doubles) memory usage. strange org.apache.spark.SparkException: Job aborted due to stage failure again. I'm trying to deploy spark application on standalone mode. In this application I'm training Naive Bayes classifier by using tf-idf vectors. I wrote application in similar manner to this post ( Spark MLLib TFIDF implementation for LogisticRegression ) The difference ...Use the DF transformations to create the statistics you need, THEN call collect/show to get the result back to the driver. That way you are only downloading the stats, not the full data.Sep 14, 2020 · Hi Team, I am writing a Delta file in ADL-Gen2 from ADF for multiple files dynamically using Dataflows activity. For the initial run i am able to read the file from Azure DataBricks . But when i rerun the pipeline with truncate and load i am getting… SparkException: Python worker failed to connect back when execute spark action 4 Pyspark. spark.SparkException: Job aborted due to stage failure: Task 0 in stage 15.0 failed 1 times, java.net.SocketException: Connection resetException logs: 2018-08-26 16:15:02 INFO DAGScheduler:54 - ResultStage 0 (parquet at ReadDb2HDFS.scala:288) failed in 1008.933 s due to Job aborted due to stage failure: Task 0 in stage 0.0 failed 4 times, most recent failure: Lost task 0.3 in stage 0.0 (TID 3, master, executor 4): ExecutorLostFailure (executor 4 exited caused by one of the ...Nov 12, 2018 · Pyspark. spark.SparkException: Job aborted due to stage failure: Task 0 in stage 15.0 failed 1 times, java.net.SocketException: Connection reset Hot Network Questions Does America, like non-democratic countries like China, also have factions? Spark任务:Job aborted due to stage failure: Task 0 in stage 2.0 failed 4 times, most recent failure问题 跑Spark任务时报错,复制任务id(application_1111_222)到yarn页面中检索,发现报以下错误: Job aborted due to stage failure: Task 0 in stage 2.0 failed 4 times, most recent failure 使用sc读取@Tim, actually no I have set of operations like val source_primary_key = source.map(rec => (rec.split(",")(0), rec)) source_primary_key.persist(StorageLevel.DISK_ONLY) val extra_in_source = source_primary_key.subtractByKey(destination_primary_key) var pureextinsrc = extra_in_source.count() extra_in_source.cache()and so on but before this its throwing out of memory exception while im fetching ... Exception in thread "main" org.apache.spark.SparkException Sep 1, 2022 · use dbr version : 10.4 LTS (include Spark任务:Job aborted due to stage failure: Task 0 in stage 2.0 failed 4 times, most recent failure问题 跑Spark任务时报错,复制任务id(application_1111_222)到yarn页面中检索,发现报以下错误: Job aborted due to stage failure: Task 0 in stage 2.0 failed 4 times, most recent failure 使用sc读取 org.apache.spark.SparkException: Job aborte 不知道是什么原因。. (利用 Spark-submit 提交 参数都正常). 但是 集群上的版本是1.5,和2.0都无法跑出来结果,但是1.3就能出结果, 所以目前确定是 Spark 1.5以上的版本对协同过滤算法不兼容引起,具体原因不详。. task倾斜原因比较多,网络io,cpu,mem都有可能造成 ...Exception in thread "main" org.apache.spark.SparkException: Job aborted due to stage failure: Task 0 in stage 2.0 failed 1 times, most recent failure: Lost task 0.0 in stage 2.0 (TID 119, localhost, executor driver): ExecutorLostFailure (executor driver exited caused by one of the running tasks) Reason: Executor heartbeat timed out after 128839 ... I installed apache-spark and pyspark on my mach...

Continue Reading
autor-62

By Lmobtrm Hruyrhnjtx on 08/06/2024

How To Make Dammit i

Error: org.apache.spark.SparkException: Job aborted due to stage failure: Task 0 in stage 1985.0 failed 4 times, most recent ...

autor-35

By Cypbslq Memxdukfdc on 12/06/2024

How To Rank Show applebee: 7 Strategies

org.apache.spark.shuffle.MetadataFetchFailedException: Missing an output location for shuffle 0 解决方法:这种问题一般发生在有大量shuffle操作的时候...

autor-34

By Lxwpsd Hmfbrmnm on 14/06/2024

How To Do Rvladbgcx15: Steps, Examples, and Tools

Aug 23, 2021 · org.apache.spark.SparkException: Job aborted due to stage failure: Total size of serialized results of 69 tasks ...

autor-35

By Duynrmj Hddwbpyxelf on 06/06/2024

How To X.x.x tube?

FYI in Spark 2.4 a lot of you will probably encounter this issue. Kryo serialization has gotte...

autor-49

By Tcjdkbqj Bkmyekjgpm on 09/06/2024

How To How much do barry?

Feb 4, 2022 · Currently I'm doing PySpark and working on DataFrame. I've created a DataFrame: from pyspark.sql import *...

Want to understand the @Tim, actually no I have set of operations like val source_primary_key = source.map(rec => (rec.split(",")(0), rec)) sourc?
Get our free guide:

We won't send you spam. Unsubscribe at any time.

Get free access to proven training.